Reaction Details
TargetCannabinoid receptor 1
LigandBDBM50325036
Substrate/Competitorn/a
Meas. Tech.ChEMBL_651609 (CHEMBL1227992)
IC50 290±n/a nM
Citation Lee, GNKim, KRAhn, SHBae, MAKang, NS Discovery of cannabinoid-1 receptor antagonists by virtual screening. Bioorg Med Chem Lett20:5130-2 (2010) 
 
Cannabinoid receptor 1
Name:Cannabinoid receptor 1
Type:G Protein-Coupled Receptor (GPCR)
Mol. Mass.:52868.96
Organism:Homo sapiens (Human)
Description:P21554
Residue:472
BDBM50325036
NameBDBM50325036
Synonyms:CHEMBL1223234 | [6,6-Dimethyl-3-(2-methyl-allyl)-4-oxo-3,5,6,8-tetrahydro-4H-pyrano[4',3':4,5]thieno[2,3-d]pyrimidin-2-ylsulfanyl]-acetic acid methyl ester
TypeSmall organic molecule
Emp. Form.C18H22N2O4S2
Mol. Mass.394.508
SMILESCOC(=O)CSc1nc2sc3COC(C)(C)Cc3c2c(=O)n1CC(C)=C