Reaction Details
TargetHistamine H3 receptor
LigandBDBM50325052
Substrate/Competitorn/a
Meas. Tech.ChEMBL_651627 (CHEMBL1228010)
IC50 3.4±n/a nM
Citation Davenport, AJStimson, CCCorsi, MVaidya, DGlenn, EJones, TDBailey, SGemkow, MJFritz, UHallett, DJ Discovery of substituted benzyl tetrazoles as histamine H3 receptor antagonists. Bioorg Med Chem Lett20:5165-9 (2010) 
 
Histamine H3 receptor
Name:Histamine H3 receptor
Type:G Protein-Coupled Receptor (GPCR)
Mol. Mass.:48691.47
Organism:Homo sapiens (Human)
Description:Binding assays were using CHO cells stably expressing hH3R receptors.
Residue:445
BDBM50325052
NameBDBM50325052
Synonyms:(2R,6S)-4-((1-benzyl-1H-tetrazol-5-yl)(4-fluorophenyl)methyl)-1-cyclobutyl-2,6-dimethylpiperazine | CHEMBL1222947
TypeSmall organic molecule
Emp. Form.C25H31FN6
Mol. Mass.434.5522
SMILESC[C@H]1CN(C[C@@H](C)N1C1CCC1)C(c1nnnn1Cc1ccccc1)c1ccc(F)cc1