Reaction Details
TargetCytochrome P450 2D6
LigandBDBM50325066
Substrate/Competitorn/a
Meas. Tech.ChEMBL_651639 (CHEMBL1228177)
IC50 700±n/a nM
Citation Davenport, AJStimson, CCCorsi, MVaidya, DGlenn, EJones, TDBailey, SGemkow, MJFritz, UHallett, DJ Discovery of substituted benzyl tetrazoles as histamine H3 receptor antagonists. Bioorg Med Chem Lett20:5165-9 (2010) 
 
Cytochrome P450 2D6
Name:Cytochrome P450 2D6
Type:Protein
Mol. Mass.:55774.82
Organism:Homo sapiens (Human)
Description:P10635
Residue:497
BDBM50325066
NameBDBM50325066
Synonyms:1-((4-(1H-1,2,4-triazol-1-yl)phenyl)(1-benzyl-1H-tetrazol-5-yl)methyl)-4-cyclobutyl-1,4-diazepane | CHEMBL1223235
TypeSmall organic molecule
Emp. Form.C26H31N9
Mol. Mass.469.5846
SMILESC(c1ccccc1)n1nnnc1C(N1CCCN(CC1)C1CCC1)c1ccc(cc1)-n1cncn1