Reaction Details
TargetHistamine H3 receptor
LigandBDBM50325089
Substrate/Competitorn/a
Meas. Tech.ChEMBL_651627 (CHEMBL1228010)
IC50 1.2±n/a nM
Citation Davenport, AJStimson, CCCorsi, MVaidya, DGlenn, EJones, TDBailey, SGemkow, MJFritz, UHallett, DJ Discovery of substituted benzyl tetrazoles as histamine H3 receptor antagonists. Bioorg Med Chem Lett20:5165-9 (2010) 
 
Histamine H3 receptor
Name:Histamine H3 receptor
Type:G Protein-Coupled Receptor (GPCR)
Mol. Mass.:48691.47
Organism:Homo sapiens (Human)
Description:Binding assays were using CHO cells stably expressing hH3R receptors.
Residue:445
BDBM50325089
NameBDBM50325089
Synonyms:1-((4-(1H-pyrazol-1-yl)phenyl)(1-benzyl-1H-tetrazol-5-yl)methyl)-4-cyclobutyl-1,4-diazepane | CHEMBL1222436
TypeSmall organic molecule
Emp. Form.C27H32N8
Mol. Mass.468.5966
SMILESC(c1ccccc1)n1nnnc1C(N1CCCN(CC1)C1CCC1)c1ccc(cc1)-n1cccn1