Reaction Details
TargetHistamine H3 receptor
LigandBDBM50325102
Substrate/Competitorn/a
Meas. Tech.ChEMBL_651627 (CHEMBL1228010)
IC50 33±n/a nM
Citation Davenport, AJStimson, CCCorsi, MVaidya, DGlenn, EJones, TDBailey, SGemkow, MJFritz, UHallett, DJ Discovery of substituted benzyl tetrazoles as histamine H3 receptor antagonists. Bioorg Med Chem Lett20:5165-9 (2010) 
 
Histamine H3 receptor
Name:Histamine H3 receptor
Type:G Protein-Coupled Receptor (GPCR)
Mol. Mass.:48691.47
Organism:Homo sapiens (Human)
Description:Binding assays were using CHO cells stably expressing hH3R receptors.
Residue:445
BDBM50325102
NameBDBM50325102
Synonyms:5-((1-benzyl-1H-tetrazol-5-yl)(4-cyclobutyl-1,4-diazepan-1-yl)methyl)-1-methyl-1H-benzo[d][1,2,3]triazole | CHEMBL1222729
TypeSmall organic molecule
Emp. Form.C25H31N9
Mol. Mass.457.5739
SMILESCn1nnc2cc(ccc12)C(N1CCCN(CC1)C1CCC1)c1nnnn1Cc1ccccc1