Reaction Details
TargetHistamine H3 receptor
LigandBDBM50325103
Substrate/Competitorn/a
Meas. Tech.ChEMBL_651627 (CHEMBL1228010)
IC50 102±n/a nM
Citation Davenport, AJStimson, CCCorsi, MVaidya, DGlenn, EJones, TDBailey, SGemkow, MJFritz, UHallett, DJ Discovery of substituted benzyl tetrazoles as histamine H3 receptor antagonists. Bioorg Med Chem Lett20:5165-9 (2010) 
 
Histamine H3 receptor
Name:Histamine H3 receptor
Type:G Protein-Coupled Receptor (GPCR)
Mol. Mass.:48691.47
Organism:Homo sapiens (Human)
Description:Binding assays were using CHO cells stably expressing hH3R receptors.
Residue:445
BDBM50325103
NameBDBM50325103
Synonyms:6-((1-benzyl-1H-tetrazol-5-yl)(4-cyclobutyl-1,4-diazepan-1-yl)methyl)quinoline | CHEMBL1222730
TypeSmall organic molecule
Emp. Form.C27H31N7
Mol. Mass.453.5819
SMILESC(c1ccccc1)n1nnnc1C(N1CCCN(CC1)C1CCC1)c1ccc2ncccc2c1