Reaction Details
TargetSerine/threonine-protein kinase Chk1
LigandBDBM50325149
Substrate/Competitorn/a
Meas. Tech.ChEMBL_651698 (CHEMBL1228388)
IC50 520±n/a nM
Citation Oza, VAshwell, SBrassil, PBreed, JDeng, CEzhuthachan, JHaye, HHorn, CJanetka, JLyne, PNewcombe, NOtterbien, LPass, MRead, JRoswell, SSu, MToader, DYu, DYu, YValentine, AWebborn, PWhite, AZabludoff, SZheng, X Discovery of a novel class of triazolones as checkpoint kinase inhibitors--hit to lead exploration. Bioorg Med Chem Lett20:5133-8 (2010) 
 
Serine/threonine-protein kinase Chk1
Name:Serine/threonine-protein kinase Chk1
Type:Enzyme Catalytic Domain
Mol. Mass.:54443.02
Organism:Homo sapiens (Human)
Description:gi_166295192
Residue:476
BDBM50325149
NameBDBM50325149
Synonyms:8-(4-methoxyphenyl)-5-methyl-[1,2,4]triazolo[4,3-a]quinolin-1(2H)-one | CHEMBL1223167
TypeSmall organic molecule
Emp. Form.C18H15N3O2
Mol. Mass.305.3306
SMILESCOc1ccc(cc1)-c1ccc2c(C)cc3n[nH]c(=O)n3c2c1