Reaction Details
TargetSerine/threonine-protein kinase Chk1
LigandBDBM50026043
Substrate/Competitorn/a
Meas. Tech.ChEMBL_651698 (CHEMBL1228388)
IC50<100±n/a nM
Citation Oza, VAshwell, SBrassil, PBreed, JDeng, CEzhuthachan, JHaye, HHorn, CJanetka, JLyne, PNewcombe, NOtterbien, LPass, MRead, JRoswell, SSu, MToader, DYu, DYu, YValentine, AWebborn, PWhite, AZabludoff, SZheng, X Discovery of a novel class of triazolones as checkpoint kinase inhibitors--hit to lead exploration. Bioorg Med Chem Lett20:5133-8 (2010) 
 
Serine/threonine-protein kinase Chk1
Name:Serine/threonine-protein kinase Chk1
Type:Enzyme Catalytic Domain
Mol. Mass.:54443.02
Organism:Homo sapiens (Human)
Description:gi_166295192
Residue:476
BDBM50026043
NameBDBM50026043
Synonyms:CHEMBL1223166
TypeSmall organic molecule
Emp. Form.C17H13N3O2
Mol. Mass.291.304
SMILESCc1cc2n[nH]c(=O)n2c2cc(ccc12)-c1ccc(O)cc1