Reaction Details
TargetSerine/threonine-protein kinase Chk1
LigandBDBM50325148
Substrate/Competitorn/a
Meas. Tech.ChEMBL_651698 (CHEMBL1228388)
IC50 1600±n/a nM
Citation Oza, VAshwell, SBrassil, PBreed, JDeng, CEzhuthachan, JHaye, HHorn, CJanetka, JLyne, PNewcombe, NOtterbien, LPass, MRead, JRoswell, SSu, MToader, DYu, DYu, YValentine, AWebborn, PWhite, AZabludoff, SZheng, X Discovery of a novel class of triazolones as checkpoint kinase inhibitors--hit to lead exploration. Bioorg Med Chem Lett20:5133-8 (2010) 
 
Serine/threonine-protein kinase Chk1
Name:Serine/threonine-protein kinase Chk1
Type:Enzyme Catalytic Domain
Mol. Mass.:54443.02
Organism:Homo sapiens (Human)
Description:gi_166295192
Residue:476
BDBM50325148
NameBDBM50325148
Synonyms:8-(furan-3-yl)-5-methyl-[1,2,4]triazolo[4,3-a]quinolin-1(2H)-one | CHEMBL1222444
TypeSmall organic molecule
Emp. Form.C15H11N3O2
Mol. Mass.265.2667
SMILESCc1cc2n[nH]c(=O)n2c2cc(ccc12)-c1ccoc1