Reaction Details
TargetSerine/threonine-protein kinase Chk1
LigandBDBM50325153
Substrate/Competitorn/a
Meas. Tech.ChEMBL_651698 (CHEMBL1228388)
IC50 1590±n/a nM
Citation Oza, VAshwell, SBrassil, PBreed, JDeng, CEzhuthachan, JHaye, HHorn, CJanetka, JLyne, PNewcombe, NOtterbien, LPass, MRead, JRoswell, SSu, MToader, DYu, DYu, YValentine, AWebborn, PWhite, AZabludoff, SZheng, X Discovery of a novel class of triazolones as checkpoint kinase inhibitors--hit to lead exploration. Bioorg Med Chem Lett20:5133-8 (2010) 
 
Serine/threonine-protein kinase Chk1
Name:Serine/threonine-protein kinase Chk1
Type:Enzyme Catalytic Domain
Mol. Mass.:54443.02
Organism:Homo sapiens (Human)
Description:gi_166295192
Residue:476
BDBM50325153
NameBDBM50325153
Synonyms:CHEMBL1223245 | N-methyl-4-(5-methyl-1-oxo-1,2-dihydro-[1,2,4]triazolo[4,3-a]quinolin-8-yl)benzamide
TypeSmall organic molecule
Emp. Form.C19H16N4O2
Mol. Mass.332.3559
SMILESCNC(=O)c1ccc(cc1)-c1ccc2c(C)cc3n[nH]c(=O)n3c2c1