Reaction Details
TargetCytochrome P450 3A4
LigandBDBM50325178
Substrate/Competitorn/a
Meas. Tech.ChEMBL_651755 (CHEMBL1228445)
IC50 14000±n/a nM
Citation Chen, ADubé, DDubé, LGagné, SGallant, MGaudreault, MGrimm, EHoule, RLacombe, PLaliberté, SLiu, SMacDonald, DMackay, BMartin, DMcKay, DPowell, DLévesque, JF Addressing time-dependent CYP 3A4 inhibition observed in a novel series of substituted amino propanamide renin inhibitors, a case study. Bioorg Med Chem Lett20:5074-9 (2010) 
 
Cytochrome P450 3A4
Name:Cytochrome P450 3A4
Type:Enzyme
Mol. Mass.:57349.57
Organism:Homo sapiens (Human)
Description:n/a
Residue:503
BDBM50325178
NameBDBM50325178
Synonyms:(R)-3-amino-N-(2-chloro-5-(3-methoxypropyl)benzyl)-N-cyclopropyl-2-(4-(2-(2,6-dichloro-4-methylphenoxy)ethoxy)benzyl)propanamide | CHEMBL1222884
TypeSmall organic molecule
Emp. Form.C33H39Cl3N2O4
Mol. Mass.634.033
SMILESCOCCCc1ccc(Cl)c(CN(C2CC2)C(=O)[C@@H](CN)Cc2ccc(OCCOc3c(Cl)cc(C)cc3Cl)cc2)c1