Reaction Details
TargetInsulin-like growth factor 1 receptor
LigandBDBM50299148
Substrate/Competitorn/a
Meas. Tech.ChEMBL_652151 (CHEMBL1228260)
IC50 8.4±n/a nM
Citation Sampognaro, AJWittman, MDCarboni, JMChang, CGreer, AFHurlburt, WWSack, JSVyas, DM Proline isosteres in a series of 2,4-disubstituted pyrrolo[1,2-f][1,2,4]triazine inhibitors of IGF-1R kinase and IR kinase. Bioorg Med Chem Lett20:5027-30 (2010) 
 
Insulin-like growth factor 1 receptor
Name:Insulin-like growth factor 1 receptor
Type:Protein
Mol. Mass.:154776.79
Organism:Homo sapiens (Human)
Description:P08069
Residue:1367
BDBM50299148
NameBDBM50299148
Synonyms:(S)-1-(4-(5-cyclopropyl-1H-pyrazol-3-ylamino)pyrrolo[1,2-f][1,2,4]triazin-2-yl)-N-(6-fluoropyridin-3-yl)-2-methylpyrrolidine-2-carboxamide BMS-754807 | CHEMBL575448
TypeSmall organic molecule
Emp. Form.C23H24FN9O
Mol. Mass.461.4948
SMILESC[C@]1(CCCN1c1nc(Nc2cc([nH]n2)C2CC2)c2cccn2n1)C(=O)Nc1ccc(F)nc1