Reaction Details
TargetInsulin-like growth factor 1 receptor
LigandBDBM50325424
Substrate/Competitorn/a
Meas. Tech.ChEMBL_652152 (CHEMBL1228261)
IC50 1±n/a nM
Citation Sampognaro, AJWittman, MDCarboni, JMChang, CGreer, AFHurlburt, WWSack, JSVyas, DM Proline isosteres in a series of 2,4-disubstituted pyrrolo[1,2-f][1,2,4]triazine inhibitors of IGF-1R kinase and IR kinase. Bioorg Med Chem Lett20:5027-30 (2010) 
 
Insulin-like growth factor 1 receptor
Name:Insulin-like growth factor 1 receptor
Type:Protein
Mol. Mass.:154776.79
Organism:Homo sapiens (Human)
Description:P08069
Residue:1367
BDBM50325424
NameBDBM50325424
Synonyms:(S)-1-(4-(5-cyclopropyl-1H-pyrazol-3-ylamino)pyrrolo[1,2-f][1,2,4]triazin-2-yl)-N-(6-fluoropyridin-3-yl)pyrrolidine-2-carboxamide | CHEMBL1222709
TypeSmall organic molecule
Emp. Form.C22H22FN9O
Mol. Mass.447.4682
SMILESFc1ccc(NC(=O)[C@@H]2CCCN2c2nc(Nc3cc([nH]n3)C3CC3)c3cccn3n2)cn1