Reaction Details
TargetExtracellular calcium-sensing receptor
LigandBDBM50325498
Substrate/Competitorn/a
Meas. Tech.ChEMBL_652215 (CHEMBL1228488)
IC50 13±n/a nM
Citation Gerspacher, MAltmann, EBeerli, RBuhl, TEndres, RGamse, RKameni-Tcheudji, JKneissel, MKrawinkler, KHMissbach, MSchmidt, ASeuwen, KWeiler, SWidler, L Penta-substituted benzimidazoles as potent antagonists of the calcium-sensing receptor (CaSR-antagonists). Bioorg Med Chem Lett20:5161-4 (2010) 
 
Extracellular calcium-sensing receptor
Name:Extracellular calcium-sensing receptor
Type:Protein
Mol. Mass.:120663.13
Organism:Homo sapiens (Human)
Description:P41180
Residue:1078
BDBM50325498
NameBDBM50325498
Synonyms:4-iodo-2-(4-isopropylphenyl)-7-methoxy-1-(2-methoxyethyl)-1H-benzo[d]imidazole | CHEMBL1223368
TypeSmall organic molecule
Emp. Form.C20H23IN2O2
Mol. Mass.450.3133
SMILESCOCCn1c(nc2c(I)ccc(OC)c12)-c1ccc(cc1)C(C)C