Reaction Details
TargetExtracellular calcium-sensing receptor
LigandBDBM50325516
Substrate/Competitorn/a
Meas. Tech.ChEMBL_652215 (CHEMBL1228488)
IC50 26±n/a nM
Citation Gerspacher, MAltmann, EBeerli, RBuhl, TEndres, RGamse, RKameni-Tcheudji, JKneissel, MKrawinkler, KHMissbach, MSchmidt, ASeuwen, KWeiler, SWidler, L Penta-substituted benzimidazoles as potent antagonists of the calcium-sensing receptor (CaSR-antagonists). Bioorg Med Chem Lett20:5161-4 (2010) 
 
Extracellular calcium-sensing receptor
Name:Extracellular calcium-sensing receptor
Type:Protein
Mol. Mass.:120663.13
Organism:Homo sapiens (Human)
Description:P41180
Residue:1078
BDBM50325516
NameBDBM50325516
Synonyms:2-(4-isopropylphenyl)-7-methoxy-5-(2-methoxybenzyl)-1-(2-methoxyethyl)-4-(trifluoromethyl)-1H-benzo[d]imidazole | CHEMBL1222489
TypeSmall organic molecule
Emp. Form.C29H31F3N2O3
Mol. Mass.512.5632
SMILESCOCCn1c(nc2c(c(Cc3ccccc3OC)cc(OC)c12)C(F)(F)F)-c1ccc(cc1)C(C)C