Reaction Details
TargetNeuropeptide Y receptor type 1
LigandBDBM50325607
Substrate/Competitorn/a
Meas. Tech.ChEMBL_652269 (CHEMBL1225472)
Ki 260±n/a nM
Citation Weiss, SKeller, MBernhardt, GBuschauer, AKönig, B N(G)-Acyl-argininamides as NPY Y(1) receptor antagonists: Influence of structurally diverse acyl substituents on stability and affinity. Bioorg Med Chem18:6292-304 (2010) 
 
Neuropeptide Y receptor type 1
Name:Neuropeptide Y receptor type 1
Type:Enzyme Catalytic Domain
Mol. Mass.:44399.07
Organism:Homo sapiens (Human)
Description:NPY-Y1 NPY1R HUMAN::P25929
Residue:384
BDBM50325607
NameBDBM50325607
Synonyms:(R)-21-(4-Hydroxybenzylcarbamoyl)-3,7,14,23-tetraoxo-24,24-diphenyl-2-oxa-6,15,17,22-tetraazatetracosan-16-iminium2,2,2-trifluoroacetate | CHEMBL1223995
TypeSmall organic molecule
Emp. Form.C39H50N6O7
Mol. Mass.714.8503
SMILESCOC(=O)CCNC(=O)CCCCCCC(=O)NC(N)=NCCC[C@@H](NC(=O)C(c1ccccc1)c1ccccc1)C(=O)NCc1ccc(O)cc1