Reaction Details
TargetSialidase
LigandBDBM50250510
Substrate/Competitorn/a
Meas. Tech.ChEMBL_652518 (CHEMBL1225721)
IC50 5700±n/a nM
Citation Ryu, HWCurtis-Long, MJJung, SJin, YMCho, JKRyu, YBLee, WSPark, KH Xanthones with neuraminidase inhibitory activity from the seedcases of Garcinia mangostana. Bioorg Med Chem18:6258-64 (2010) 
 
Sialidase
Name:Sialidase
Type:PROTEIN
Mol. Mass.:42808.79
Organism:Clostridium perfringens
Description:ChEMBL_991336
Residue:382
BDBM50250510
NameBDBM50250510
Synonyms:CHEMBL462879 | GARCINONE D
TypeSmall organic molecule
Emp. Form.C24H28O7
Mol. Mass.428.4749
SMILES[#6]-[#8]-c1c(-[#8])cc2oc3cc(-[#8])c(-[#6]\[#6]=[#6](\[#6])-[#6])c(-[#8])c3c(=O)c2c1-[#6]-[#6]C([#6])([#6])[#8]