Reaction Details
TargetSialidase
LigandBDBM50214969
Substrate/Competitorn/a
Meas. Tech.ChEMBL_652516 (CHEMBL1225719)
Ki 5800±n/a nM
Citation Ryu, HWCurtis-Long, MJJung, SJin, YMCho, JKRyu, YBLee, WSPark, KH Xanthones with neuraminidase inhibitory activity from the seedcases of Garcinia mangostana. Bioorg Med Chem18:6258-64 (2010) 
 
Sialidase
Name:Sialidase
Type:PROTEIN
Mol. Mass.:42808.79
Organism:Clostridium perfringens
Description:ChEMBL_991336
Residue:382
BDBM50214969
NameBDBM50214969
Synonyms:1,3,6-Trihydroxy-7-methoxy-2,8-bis-(3-methyl-but-2-enyl)-xanthen-9-one 1,3,6-trihydroxy-7-methoxy-2,8-diprenylxanthone Mangostin | alpha-mangostin
TypeSmall organic molecule
Emp. Form.C24H26O6
Mol. Mass.410.4596
SMILES[#6]-[#8]-c1c(-[#8])cc2oc3cc(-[#8])c(-[#6]\[#6]=[#6](\[#6])-[#6])c(-[#8])c3c(=O)c2c1-[#6]\[#6]=[#6](\[#6])-[#6]