Reaction Details
TargetSodium channel protein type 9 subunit alpha
LigandBDBM50325767
Substrate/Competitorn/a
Meas. Tech.ChEMBL_652622 (CHEMBL1225825)
Ki 0.018000±n/a nM
Citation Tyagarajan, SChakravarty, PKZhou, BTaylor, BFisher, MHWyvratt, MJLyons, KKlatt, TLi, XKumar, SWilliams, BFelix, JPriest, BTBrochu, RMWarren, VSmith, MGarcia, MKaczorowski, GJMartin, WJAbbadie, CMcGowan, EJochnowitz, NParsons, WH Substituted biaryl pyrazoles as sodium channel blockers. Bioorg Med Chem Lett20:5480-3 (2010) 
 
Sodium channel protein type 9 subunit alpha
Name:Sodium channel protein type 9 subunit alpha
Type:Protein
Mol. Mass.:226375.97
Organism:Homo sapiens (Human)
Description:Q15858
Residue:1988
BDBM50325767
NameBDBM50325767
Synonyms:3-(2'-chlorobiphenyl-3-yl)-1H-pyrazole-1-carboxamide | CHEMBL1224266
TypeSmall organic molecule
Emp. Form.C16H12ClN3O
Mol. Mass.297.739
SMILESNC(=O)n1ccc(n1)-c1cccc(c1)-c1ccccc1Cl