Reaction Details
TargetSodium channel protein type 9 subunit alpha
LigandBDBM50325762
Substrate/Competitorn/a
Meas. Tech.ChEMBL_652624 (CHEMBL1225827)
IC50 426±n/a nM
Citation Tyagarajan, SChakravarty, PKZhou, BTaylor, BFisher, MHWyvratt, MJLyons, KKlatt, TLi, XKumar, SWilliams, BFelix, JPriest, BTBrochu, RMWarren, VSmith, MGarcia, MKaczorowski, GJMartin, WJAbbadie, CMcGowan, EJochnowitz, NParsons, WH Substituted biaryl pyrazoles as sodium channel blockers. Bioorg Med Chem Lett20:5480-3 (2010) 
 
Sodium channel protein type 9 subunit alpha
Name:Sodium channel protein type 9 subunit alpha
Type:Protein
Mol. Mass.:226375.97
Organism:Homo sapiens (Human)
Description:Q15858
Residue:1988
BDBM50325762
NameBDBM50325762
Synonyms:1-(2',4'-bis(trifluoromethyl)biphenyl-3-yl)-5-methyl-1H-pyrazole-3-carboxamide | CHEMBL1224194
TypeSmall organic molecule
Emp. Form.C19H13F6N3O
Mol. Mass.413.3164
SMILESCc1cc(nn1-c1cccc(c1)-c1ccc(cc1C(F)(F)F)C(F)(F)F)C(N)=O