Reaction Details
TargetMelanin-concentrating hormone receptor 1
LigandBDBM50325971
Substrate/Competitorn/a
Meas. Tech.ChEMBL_654168 (CHEMBL1228974)
IC50 0.6±n/a nM
Citation Sasmal, PKSasmal, SRao, PTVenkatesham, BRoshaiah, MAbbineni, CKhanna, IJadhav, VPSuresh, JTalwar, RMuzeeb, SReceveur, JMFrimurer, TMRist, ØElster, LHögberg, T Discovery of novel, orally available benzimidazoles as melanin concentrating hormone receptor 1 (MCHR1) antagonists. Bioorg Med Chem Lett20:5443-8 (2010) 
 
Melanin-concentrating hormone receptor 1
Name:Melanin-concentrating hormone receptor 1
Type:G Protein-Coupled Receptor (GPCR)
Mol. Mass.:45976.27
Organism:Homo sapiens (Human)
Description:Membranes from CHO-K1 cells stably expressing human MCH1R were used in assays.
Residue:422
BDBM50325971
NameBDBM50325971
Synonyms:CHEMBL1224229 | N-(3-(1-(4-(1-(4-fluorophenyl)-1H-benzo[d]imidazol-2-yl)butyl)piperidin-4-yl)phenyl)acetamide
TypeSmall organic molecule
Emp. Form.C30H33FN4O
Mol. Mass.484.6076
SMILESCC(=O)Nc1cccc(c1)C1CCN(CCCCc2nc3ccccc3n2-c2ccc(F)cc2)CC1