Reaction Details
TargetMAP kinase-activated protein kinase 2
LigandBDBM50126829
Substrate/Competitorn/a
Meas. Tech.ChEMBL_660310 (CHEMBL1249806)
IC50 5400±n/a nM
Citation Davies, SPReddy, HCaivano, MCohen, P Specificity and mechanism of action of some commonly used protein kinase inhibitors. Biochem J351:95-105 (2001) MAP kinase-activated protein kinase 2
Name:MAP kinase-activated protein kinase 2
Type:Serine/threonine-protein kinase
Mol. Mass.:45579.87
Organism:Homo sapiens (Human)
Description:P49137
Residue:400
BDBM50126829
NameBDBM50126829
Synonyms:(E)-1-(6-(3-acetyl-2,4,6-trihydroxy-5-methylbenzyl)-5,7-dihydroxy-2,2-dimethyl-2H-chromen-8-yl)-3-phenylprop-2-en-1-one 1-[6-(3-Acetyl-2,4,6-trihydroxy-5-methyl-benzyl)-5,7-dihydroxy-2,2-dimethyl-2H-chromen-8-yl]-3-phenyl-propenone R5648 (Rottlerin) | ROTTLERIN
TypeSmall organic molecule
Emp. Form.C30H28O8
Mol. Mass.516.5385
SMILESCC(=O)c1c(O)c(C)c(O)c(Cc2c(O)c3C=CC(C)(C)Oc3c(C(=O)C=Cc3ccccc3)c2O)c1O