Reaction Details
TargetRibosomal protein S6 kinase beta-1
LigandBDBM15211
Substrate/Competitorn/a
Meas. Tech.ChEMBL_660302 (CHEMBL1249798)
IC50 80±n/a nM
Citation Davies, SPReddy, HCaivano, MCohen, P Specificity and mechanism of action of some commonly used protein kinase inhibitors. Biochem J351:95-105 (2001) Ribosomal protein S6 kinase beta-1
Name:Ribosomal protein S6 kinase beta-1
Type:Enzyme
Mol. Mass.:59139.89
Organism:Homo sapiens (Human)
Description:His-tagged S6K1.
Residue:525
BDBM15211
NameBDBM15211
Synonyms:CHEMBL104264 H89 N-(2-{[(2E)-3-(4-bromophenyl)prop-2-en-1-yl]amino}ethyl)isoquinoline-5-sulfonamide | N-[2-[[(E)-3-(4-bromophenyl)prop-2-enyl]amino]ethyl]isoquinoline-5-sulfonamide
TypeSmall organic molecule
Emp. Form.C20H20BrN3O2S
Mol. Mass.446.361
SMILESBrc1ccc(\C=C\CNCCNS(=O)(=O)c2cccc3cnccc23)cc1