Reaction Details
TargetCathepsin F
LigandBDBM12311
Substrate/Competitorn/a
Meas. Tech.ChEMBL_656022 (CHEMBL1245066)
IC50 1100±n/a nM
Citation Liverton, NJCarroll, SSDimuzio, JFandozzi, CGraham, DJHazuda, DHolloway, MKLudmerer, SWMcCauley, JAMcIntyre, CJOlsen, DBRudd, MTStahlhut, MVacca, JP MK-7009, a potent and selective inhibitor of hepatitis C virus NS3/4A protease. Antimicrob Agents Chemother54:305-11 (2009) 
 
Cathepsin F
Name:Cathepsin F
Type:PROTEIN
Mol. Mass.:53373.38
Organism:Homo sapiens (Human)
Description:ChEMBL_852650
Residue:484
BDBM12311
NameBDBM12311
Synonyms:(1R,5S)-N-[3-Amino-1-(cyclobutylmethyl)-2,3-dioxopropyl]-3-[2(S)-[[[(1,1-dimethylethyl)amino]carbonyl]amino]-3,3-dimethyl-1-oxobutyl]-6,6-dimethyl-3-azabicyclo[3.1.0]hexan-2(S)-carboxamide BOCEPREVIR acs.jmedchem.1c00409_ST.355
TypeSmall organic molecule
Emp. Form.C27H45N5O5
Mol. Mass.519.6767
SMILESCC(C)(C)NC(=O)N[C@H](C(=O)N1C[C@H]2[C@@H]([C@H]1C(=O)NC(CC1CCC1)C(=O)C(N)=O)C2(C)C)C(C)(C)C