Reaction Details
TargetCyclin-dependent kinase 1
LigandBDBM50326171
Substrate/Competitorn/a
Meas. Tech.ChEMBL_658925 (CHEMBL1246064)
IC50 910±n/a nM
Citation Al-Sha'er, MATaha, MO Discovery of novel CDK1 inhibitors by combining pharmacophore modeling, QSAR analysis and in silico screening followed by in vitro bioassay. Eur J Med Chem45:4316-30 (2010) 
 
Cyclin-dependent kinase 1
Name:Cyclin-dependent kinase 1
Type:Enzyme Subunit
Mol. Mass.:34101.08
Organism:Homo sapiens (Human)
Description:P06493
Residue:297
BDBM50326171
NameBDBM50326171
Synonyms:CHEMBL1243004 | dimethyl 6,6'-sulfonylbis(3-acetamidobenzoate)
TypeSmall organic molecule
Emp. Form.C20H20N2O8S
Mol. Mass.448.446
SMILESCOC(=O)c1cc(NC(C)=O)ccc1S(=O)(=O)c1ccc(NC(C)=O)cc1C(=O)OC