Reaction Details
TargetCyclin-dependent kinase/G2/mitotic-specific cyclin- 1
LigandBDBM50326169
Substrate/Competitorn/a
Meas. Tech.ChEMBL_658926 (CHEMBL1246065)
IC50 600±n/a nM
Citation Al-Sha'er, MATaha, MO Discovery of novel CDK1 inhibitors by combining pharmacophore modeling, QSAR analysis and in silico screening followed by in vitro bioassay. Eur J Med Chem45:4316-30 (2010) 
 
Cyclin-dependent kinase/G2/mitotic-specific cyclin- 1
Name:Cyclin-dependent kinase/G2/mitotic-specific cyclin- 1
Type:Protein Complex
Mol. Mass.:n/a
Description:CDK1/Cyclin B complexes were purified from insect cells co-infected with baculovirus vectors containing each of the components.
Components:This complex has 2 components.
Component 1
Name:Cyclin-dependent kinase 1
Synonyms:CDC2 CDK1 CDKN1 Cell division protein kinase 1 P34CDC2 | p34 protein kinase
Type:Enzyme Subunit
Mol. Mass.:34101.08
Organism:Homo sapiens (Human)
Description:P06493
Residue:297
Component 2
Name:G2/mitotic-specific cyclin-B1
Synonyms:CCNB CCNB1_HUMAN
Type:Enzyme Subunit
Mol. Mass.:48340.95
Organism:Homo sapiens (Human)
Description:P14635
Residue:433
BDBM50326169
NameBDBM50326169
Synonyms:(S)-methyl 4-hydroxy-2-(4-hydroxy-3-(3-methylbut-2-enyl)benzyl)-3-(4-hydroxyphenyl)-5-oxo-2,5-dihydrofuran-2-carboxylate | CHEMBL1242973
TypeSmall organic molecule
Emp. Form.C24H24O7
Mol. Mass.424.4432
SMILES[#6]-[#8]-[#6](=O)[C@@]1([#6]-c2ccc(-[#8])c(-[#6]\[#6]=[#6](\[#6])-[#6])c2)[#8]-[#6](=O)-[#6](=O)-[#6]1-c1ccc(-[#8])cc1