Reaction Details
TargetHistamine H3 receptor
LigandBDBM50326297
Substrate/Competitorn/a
Meas. Tech.ChEMBL_659946 (CHEMBL1247347)
Ki 76±n/a nM
Citation Ishikawa, MWatanabe, TKudo, TYokoyama, FYamauchi, MKato, KKakui, NSato, Y Investigation of the histamine H3 receptor binding site. Design and synthesis of hybrid agonists with a lipophilic side chain. J Med Chem53:6445-56 (2010) 
 
Histamine H3 receptor
Name:Histamine H3 receptor
Type:G Protein-Coupled Receptor (GPCR)
Mol. Mass.:48691.47
Organism:Homo sapiens (Human)
Description:Binding assays were using CHO cells stably expressing hH3R receptors.
Residue:445
BDBM50326297
NameBDBM50326297
Synonyms:3-((1H-imidazol-4-yl)methyl)pyridine CHEMBL78838
TypeSmall organic molecule
Emp. Form.C9H9N3
Mol. Mass.159.1879
SMILESC(c1cnc[nH]1)c1cccnc1