Reaction Details
TargetHistamine H3 receptor
LigandBDBM50326291
Substrate/Competitorn/a
Meas. Tech.ChEMBL_659947 (CHEMBL1247348)
EC50>1000±n/a nM
Citation Ishikawa, MWatanabe, TKudo, TYokoyama, FYamauchi, MKato, KKakui, NSato, Y Investigation of the histamine H3 receptor binding site. Design and synthesis of hybrid agonists with a lipophilic side chain. J Med Chem53:6445-56 (2010) 
 
Histamine H3 receptor
Name:Histamine H3 receptor
Type:G Protein-Coupled Receptor (GPCR)
Mol. Mass.:48691.47
Organism:Homo sapiens (Human)
Description:Binding assays were using CHO cells stably expressing hH3R receptors.
Residue:445
BDBM50326291
NameBDBM50326291
Synonyms:3-(4-tert-Butylphenylthio)-2-(1H-imidazol-4-yl)-N-methylpropane-1-amine | CHEMBL1243304
TypeSmall organic molecule
Emp. Form.C17H25N3S
Mol. Mass.303.465
SMILESCNCC(CSc1ccc(cc1)C(C)(C)C)c1cnc[nH]1