Reaction Details
TargetHistamine H3 receptor
LigandBDBM50326295
Substrate/Competitorn/a
Meas. Tech.ChEMBL_659947 (CHEMBL1247348)
EC50 140±n/a nM
Citation Ishikawa, MWatanabe, TKudo, TYokoyama, FYamauchi, MKato, KKakui, NSato, Y Investigation of the histamine H3 receptor binding site. Design and synthesis of hybrid agonists with a lipophilic side chain. J Med Chem53:6445-56 (2010) 
 
Histamine H3 receptor
Name:Histamine H3 receptor
Type:G Protein-Coupled Receptor (GPCR)
Mol. Mass.:48691.47
Organism:Homo sapiens (Human)
Description:Binding assays were using CHO cells stably expressing hH3R receptors.
Residue:445
BDBM50326295
NameBDBM50326295
Synonyms:4-(2-(4-tert-Butylphenylthio)-1-(1H-imidazol-4-yl)ethyl)pyridine | CHEMBL1243393
TypeSmall organic molecule
Emp. Form.C20H23N3S
Mol. Mass.337.482
SMILESCC(C)(C)c1ccc(SCC(c2cnc[nH]2)c2ccncc2)cc1