Reaction Details
TargetCytochrome P450 1A2
LigandBDBM50326292
Substrate/Competitorn/a
Meas. Tech.ChEMBL_659954 (CHEMBL1247355)
IC50>100000±n/a nM
Citation Ishikawa, MWatanabe, TKudo, TYokoyama, FYamauchi, MKato, KKakui, NSato, Y Investigation of the histamine H3 receptor binding site. Design and synthesis of hybrid agonists with a lipophilic side chain. J Med Chem53:6445-56 (2010) 
 
Cytochrome P450 1A2
Name:Cytochrome P450 1A2
Type:Enzyme
Mol. Mass.:58423.38
Organism:Homo sapiens (Human)
Description:P05177
Residue:516
BDBM50326292
NameBDBM50326292
Synonyms:4-(2-(4-tert-Butylphenylthio)-1-(1H-imidazol-4-yl)ethyl)piperidine | CHEMBL1243333
TypeSmall organic molecule
Emp. Form.C20H29N3S
Mol. Mass.343.529
SMILESCC(C)(C)c1ccc(SCC(C2CCNCC2)c2cnc[nH]2)cc1