Reaction Details
TargetCytochrome P450 3A4
LigandBDBM50326289
Substrate/Competitorn/a
Meas. Tech.ChEMBL_659957 (CHEMBL1247358)
IC50 350±n/a nM
Citation Ishikawa, MWatanabe, TKudo, TYokoyama, FYamauchi, MKato, KKakui, NSato, Y Investigation of the histamine H3 receptor binding site. Design and synthesis of hybrid agonists with a lipophilic side chain. J Med Chem53:6445-56 (2010) 
 
Cytochrome P450 3A4
Name:Cytochrome P450 3A4
Type:Enzyme
Mol. Mass.:57349.57
Organism:Homo sapiens (Human)
Description:n/a
Residue:503
BDBM50326289
NameBDBM50326289
Synonyms:4-(1-(1H-Imidazole-4-yl)-2-(4-trifluoromeethylphenylthio)ethyl)-pyridine | CHEMBL1243367
TypeSmall organic molecule
Emp. Form.C17H14F3N3S
Mol. Mass.349.373
SMILESFC(F)(F)c1ccc(SCC(c2cnc[nH]2)c2ccncc2)cc1