Reaction Details
TargetNADPH oxidase 4
LigandBDBM50326485
Substrate/Competitorn/a
Meas. Tech.ChEMBL_658093 (CHEMBL1249158)
IC50 240±n/a nM
Citation Borbély, GSzabadkai, IHorváth, ZMarkó, PVarga, ZBreza, NBaska, FVántus, THuszár, MGeiszt, MHunyady, LBuday, LOrfi, LKéri, G Small-molecule inhibitors of NADPH oxidase 4. J Med Chem53:6758-62 (2010) 
 
NADPH oxidase 4
Name:NADPH oxidase 4
Type:PROTEIN
Mol. Mass.:66954.54
Organism:Homo sapiens (Human)
Description:ChEMBL_792879
Residue:578
BDBM50326485
NameBDBM50326485
Synonyms:CHEMBL1243033 | N-4-(3-Amino-phenyl)-benzo[4,5]thieno[3,2-d]pyrimidine-4,8-diamine
TypeSmall organic molecule
Emp. Form.C16H13N5S
Mol. Mass.307.373
SMILESNc1cccc(Nc2ncnc3c4cc(N)ccc4sc23)c1