Reaction Details
TargetNADPH oxidase 4
LigandBDBM50326486
Substrate/Competitorn/a
Meas. Tech.ChEMBL_658093 (CHEMBL1249158)
IC50 1020±n/a nM
Citation Borbély, GSzabadkai, IHorváth, ZMarkó, PVarga, ZBreza, NBaska, FVántus, THuszár, MGeiszt, MHunyady, LBuday, LOrfi, LKéri, G Small-molecule inhibitors of NADPH oxidase 4. J Med Chem53:6758-62 (2010) 
 
NADPH oxidase 4
Name:NADPH oxidase 4
Type:PROTEIN
Mol. Mass.:66954.54
Organism:Homo sapiens (Human)
Description:ChEMBL_792879
Residue:578
BDBM50326486
NameBDBM50326486
Synonyms:CHEMBL1243031 | N'-(3,4-dihydroxybenzylidene)-2-(3-nitrophenyl)-2-oxoacetohydrazide
TypeSmall organic molecule
Emp. Form.C15H11N3O6
Mol. Mass.329.2643
SMILESOc1ccc(C=NNC(=O)C(=O)c2cccc(c2)[N+]([O-])=O)cc1O