Reaction Details
TargetEpidermal growth factor receptor
LigandBDBM50326517
Substrate/Competitorn/a
Meas. Tech.ChEMBL_658103 (CHEMBL1249168)
IC50 0.57±n/a nM
Citation Pisaneschi, FNguyen, QDShamsaei, EGlaser, MRobins, EKaliszczak, MSmith, GSpivey, ACAboagye, EO Development of a new epidermal growth factor receptor positron emission tomography imaging agent based on the 3-cyanoquinoline core: synthesis and biological evaluation. Bioorg Med Chem18:6634-45 (2010) 
 
Epidermal growth factor receptor
Name:Epidermal growth factor receptor
Type:Receptor Kinase Domain
Mol. Mass.:134279.59
Organism:Homo sapiens (Human)
Description:P00533
Residue:1210
BDBM50326517
NameBDBM50326517
Synonyms:(E)-4-[(4-Fluorobenzyl)methylamino]-but-2-enoic acid[4-(3-chloro-4-fluorophenylamino)-3-cyano-7-ethoxyquinoline-6-yl]amide | CHEMBL1243254
TypeSmall organic molecule
Emp. Form.C30H26ClF2N5O2
Mol. Mass.562.01
SMILESCCOc1cc2ncc(C#N)c(Nc3ccc(F)c(Cl)c3)c2cc1NC(=O)\C=C\CN(C)Cc1ccc(F)cc1