Reaction Details
TargetVascular endothelial growth factor receptor 2
LigandBDBM50327049
Substrate/Competitorn/a
Meas. Tech.ChEMBL_663741 (CHEMBL1250641)
IC50 940±n/a nM
Citation Oguro, YMiyamoto, NOkada, KTakagi, TIwata, HAwazu, YMiki, HHori, AKamiyama, KImamura, S Design, synthesis, and evaluation of 5-methyl-4-phenoxy-5H-pyrrolo[3,2-d]pyrimidine derivatives: novel VEGFR2 kinase inhibitors binding to inactive kinase conformation. Bioorg Med Chem18:7260-73 (2010) 
 
Vascular endothelial growth factor receptor 2
Name:Vascular endothelial growth factor receptor 2
Type:Receptor Tyrosine Kinase
Mol. Mass.:151510.97
Organism:Homo sapiens (Human)
Description:P35968
Residue:1356
BDBM50327049
NameBDBM50327049
Synonyms:CHEMBL1255010 | N-{3-[(5-Methyl-5H-pyrrolo[3,2-d]pyrimidin-4-yl)oxy]phenyl}-benzamide
TypeSmall organic molecule
Emp. Form.C20H16N4O2
Mol. Mass.344.3666
SMILESCn1ccc2ncnc(Oc3cccc(NC(=O)c4ccccc4)c3)c12