Reaction Details
TargetPeroxisome proliferator-activated receptor delta
LigandBDBM50311792
Substrate/Competitorn/a
Meas. Tech.ChEMBL_663795 (CHEMBL1250695)
EC50 11±n/a nM
Citation Kasuga, JIshikawa, MYonehara, MMakishima, MHashimoto, YMiyachi, H Improvement of water-solubility of biarylcarboxylic acid peroxisome proliferator-activated receptor (PPAR)d-selective partial agonists by disruption of molecular planarity/symmetry. Bioorg Med Chem18:7164-73 (2010) 
 
Peroxisome proliferator-activated receptor delta
Name:Peroxisome proliferator-activated receptor delta
Type:Enzyme
Mol. Mass.:49910.45
Organism:Homo sapiens (Human)
Description:Q03181
Residue:441
BDBM50311792
NameBDBM50311792
Synonyms:4'-butoxy-3'-((2-fluoro-4-(trifluoromethyl)benzamido)methyl)-2-methylbiphenyl-4-carboxylic acid | CHEMBL1082079
TypeSmall organic molecule
Emp. Form.C27H25F4NO4
Mol. Mass.503.4853
SMILESCCCCOc1ccc(cc1CNC(=O)c1ccc(cc1F)C(F)(F)F)-c1ccc(cc1C)C(O)=O