Reaction Details
TargetCytochrome P450 2C9
LigandBDBM50327475
Substrate/Competitorn/a
Meas. Tech.ChEMBL_664622 (CHEMBL1260336)
IC50>50000±n/a nM
Citation Richter, HGFreichel, CHuwyler, JNakagawa, TNettekoven, MPlancher, JMRaab, SRoche, OSchuler, FTaylor, SUllmer, CWiegand, R Discovery of potent and selective histamine H3 receptor inverse agonists based on the 3,4-dihydro-2H-pyrazino[1,2-a]indol-1-one scaffold. Bioorg Med Chem Lett20:5713-7 (2010) 
 
Cytochrome P450 2C9
Name:Cytochrome P450 2C9
Type:Enzyme
Mol. Mass.:55636.33
Organism:Homo sapiens (Human)
Description:P11712
Residue:490
BDBM50327475
NameBDBM50327475
Synonyms:(S)-8-(1-isopropylpiperidin-4-yloxy)-3-methyl-3,4-dihydropyrazino[1,2-a]indol-1(2H)-one | CHEMBL1257850
TypeSmall organic molecule
Emp. Form.C20H27N3O2
Mol. Mass.341.4473
SMILESCC(C)N1CCC(CC1)Oc1ccc2n3C[C@H](C)NC(=O)c3cc2c1