Reaction Details
TargetCytochrome P450 3A4
LigandBDBM50269055
Substrate/Competitorn/a
Meas. Tech.ChEMBL_664620 (CHEMBL1260334)
IC50>50000±n/a nM
Citation Richter, HGFreichel, CHuwyler, JNakagawa, TNettekoven, MPlancher, JMRaab, SRoche, OSchuler, FTaylor, SUllmer, CWiegand, R Discovery of potent and selective histamine H3 receptor inverse agonists based on the 3,4-dihydro-2H-pyrazino[1,2-a]indol-1-one scaffold. Bioorg Med Chem Lett20:5713-7 (2010) 
 
Cytochrome P450 3A4
Name:Cytochrome P450 3A4
Type:Enzyme
Mol. Mass.:57349.57
Organism:Homo sapiens (Human)
Description:n/a
Residue:503
BDBM50269055
NameBDBM50269055
Synonyms:(4,4-Difluoropiperidin-1-yl)[1-isopropyl-5-(1-isopropylpiperidin-4-yloxy)-1H-indol-2-yl]methanone | CHEMBL497031
TypeSmall organic molecule
Emp. Form.C25H35F2N3O2
Mol. Mass.447.5611
SMILESCC(C)N1CCC(CC1)Oc1ccc2n(C(C)C)c(cc2c1)C(=O)N1CCC(F)(F)CC1