Reaction Details
TargetCytochrome P450 3A4
LigandBDBM50327482
Substrate/Competitorn/a
Meas. Tech.ChEMBL_664620 (CHEMBL1260334)
IC50>50000±n/a nM
Citation Richter, HGFreichel, CHuwyler, JNakagawa, TNettekoven, MPlancher, JMRaab, SRoche, OSchuler, FTaylor, SUllmer, CWiegand, R Discovery of potent and selective histamine H3 receptor inverse agonists based on the 3,4-dihydro-2H-pyrazino[1,2-a]indol-1-one scaffold. Bioorg Med Chem Lett20:5713-7 (2010) 
 
Cytochrome P450 3A4
Name:Cytochrome P450 3A4
Type:Enzyme
Mol. Mass.:57349.57
Organism:Homo sapiens (Human)
Description:n/a
Residue:503
BDBM50327482
NameBDBM50327482
Synonyms:8-(1-isopropylpiperidin-4-yloxy)-2-methyl-3,4-dihydropyrazino[1,2-a]indol-1(2H)-one | CHEMBL1258873
TypeSmall organic molecule
Emp. Form.C20H27N3O2
Mol. Mass.341.4473
SMILESCC(C)N1CCC(CC1)Oc1ccc2n3CCN(C)C(=O)c3cc2c1