Reaction Details
TargetHistamine H3 receptor
LigandBDBM50327477
Substrate/Competitorn/a
Meas. Tech.ChEMBL_664613 (CHEMBL1260327)
Ki 5±n/a nM
Citation Richter, HGFreichel, CHuwyler, JNakagawa, TNettekoven, MPlancher, JMRaab, SRoche, OSchuler, FTaylor, SUllmer, CWiegand, R Discovery of potent and selective histamine H3 receptor inverse agonists based on the 3,4-dihydro-2H-pyrazino[1,2-a]indol-1-one scaffold. Bioorg Med Chem Lett20:5713-7 (2010) 
 
Histamine H3 receptor
Name:Histamine H3 receptor
Type:G Protein-Coupled Receptor (GPCR)
Mol. Mass.:48691.47
Organism:Homo sapiens (Human)
Description:Binding assays were using CHO cells stably expressing hH3R receptors.
Residue:445
BDBM50327477
NameBDBM50327477
Synonyms:(R)-2-(cyclopropylmethyl)-8-(1-isopropylpiperidin-4-yloxy)-3-methyl-3,4-dihydropyrazino[1,2-a]indol-1(2H)-one | CHEMBL1257965
TypeSmall organic molecule
Emp. Form.C24H33N3O2
Mol. Mass.395.5377
SMILESCC(C)N1CCC(CC1)Oc1ccc2n3C[C@@H](C)N(CC4CC4)C(=O)c3cc2c1