Reaction Details
TargetHistamine H3 receptor
LigandBDBM50327491
Substrate/Competitorn/a
Meas. Tech.ChEMBL_664613 (CHEMBL1260327)
Ki 17±n/a nM
Citation Richter, HGFreichel, CHuwyler, JNakagawa, TNettekoven, MPlancher, JMRaab, SRoche, OSchuler, FTaylor, SUllmer, CWiegand, R Discovery of potent and selective histamine H3 receptor inverse agonists based on the 3,4-dihydro-2H-pyrazino[1,2-a]indol-1-one scaffold. Bioorg Med Chem Lett20:5713-7 (2010) 
 
Histamine H3 receptor
Name:Histamine H3 receptor
Type:G Protein-Coupled Receptor (GPCR)
Mol. Mass.:48691.47
Organism:Homo sapiens (Human)
Description:Binding assays were using CHO cells stably expressing hH3R receptors.
Residue:445
BDBM50327491
NameBDBM50327491
Synonyms:2-(cyclopropylmethyl)-9-(1-isopropylpiperidin-4-yloxy)-2,3,4,5-tetrahydro-1H-[1,4]diazepino[1,2-a]indol-1-one | CHEMBL1257728
TypeSmall organic molecule
Emp. Form.C24H33N3O2
Mol. Mass.395.5377
SMILESCC(C)N1CCC(CC1)Oc1ccc2n3CCCN(CC4CC4)C(=O)c3cc2c1