Reaction Details
TargetHistamine H3 receptor
LigandBDBM50327484
Substrate/Competitorn/a
Meas. Tech.ChEMBL_664613 (CHEMBL1260327)
Ki 46±n/a nM
Citation Richter, HGFreichel, CHuwyler, JNakagawa, TNettekoven, MPlancher, JMRaab, SRoche, OSchuler, FTaylor, SUllmer, CWiegand, R Discovery of potent and selective histamine H3 receptor inverse agonists based on the 3,4-dihydro-2H-pyrazino[1,2-a]indol-1-one scaffold. Bioorg Med Chem Lett20:5713-7 (2010) 
 
Histamine H3 receptor
Name:Histamine H3 receptor
Type:G Protein-Coupled Receptor (GPCR)
Mol. Mass.:48691.47
Organism:Homo sapiens (Human)
Description:Binding assays were using CHO cells stably expressing hH3R receptors.
Residue:445
BDBM50327484
NameBDBM50327484
Synonyms:2-(2-hydroxyethyl)-8-(1-isopropylpiperidin-4-yloxy)-3,4-dihydropyrazino[1,2-a]indol-1(2H)-one | CHEMBL1257607
TypeSmall organic molecule
Emp. Form.C21H29N3O3
Mol. Mass.371.4733
SMILESCC(C)N1CCC(CC1)Oc1ccc2n3CCN(CCO)C(=O)c3cc2c1