Reaction Details
TargetHistamine H3 receptor
LigandBDBM50327494
Substrate/Competitorn/a
Meas. Tech.ChEMBL_664614 (CHEMBL1260328)
EC50 140±n/a nM
Citation Richter, HGFreichel, CHuwyler, JNakagawa, TNettekoven, MPlancher, JMRaab, SRoche, OSchuler, FTaylor, SUllmer, CWiegand, R Discovery of potent and selective histamine H3 receptor inverse agonists based on the 3,4-dihydro-2H-pyrazino[1,2-a]indol-1-one scaffold. Bioorg Med Chem Lett20:5713-7 (2010) 
 
Histamine H3 receptor
Name:Histamine H3 receptor
Type:G Protein-Coupled Receptor (GPCR)
Mol. Mass.:48691.47
Organism:Homo sapiens (Human)
Description:Binding assays were using CHO cells stably expressing hH3R receptors.
Residue:445
BDBM50327494
NameBDBM50327494
Synonyms:(S)-8-(3-(2-methylpyrrolidin-1-yl)propoxy)-3,4-dihydropyrazino[1,2-a]indol-1(2H)-one | CHEMBL1258194
TypeSmall organic molecule
Emp. Form.C19H25N3O2
Mol. Mass.327.4207
SMILESC[C@H]1CCCN1CCCOc1ccc2n3CCNC(=O)c3cc2c1