Reaction Details
TargetHistamine receptor H4
LigandBDBM50327860
Substrate/Competitorn/a
Meas. Tech.ChEMBL_664959 (CHEMBL1259916)
Ki>10000±n/a nM
Citation Xu, RHong, JMorse, CLPike, VW Synthesis, structure-affinity relationships, and radiolabeling of selective high-affinity 5-HT4 receptor ligands as prospective imaging probes for positron emission tomography. J Med Chem53:7035-47 (2010) 
 
Histamine receptor H4
Name:Histamine receptor H4
Type:Enzyme Catalytic Domain
Mol. Mass.:44536.99
Organism:GUINEA PIG
Description:HISTAMINE H4 HRH4 GUINEA PIG::Q91ZY3
Residue:389
BDBM50327860
NameBDBM50327860
Synonyms:(1-Butylpiperidin-4-yl)methyl 7-chloro-8-(methylamino)-2,3-dihydrobenzo[b][1,4]dioxine-5-carboxylate | CHEMBL1258223
TypeSmall organic molecule
Emp. Form.C20H29ClN2O4
Mol. Mass.396.908
SMILESCCCCN1CCC(COC(=O)c2cc(Cl)c(NC)c3OCCOc23)CC1