Reaction Details
TargetFatty acid synthase
LigandBDBM50241454
Substrate/Competitorn/a
Meas. Tech.ChEMBL_665032 (CHEMBL1260142)
IC50 24830±n/a nM
Citation Jiang, HZQuan, XFTian, WXHu, JMWang, PCHuang, SZCheng, ZQLiang, WJZhou, JMa, XFZhao, YX Fatty acid synthase inhibitors of phenolic constituents isolated from Garcinia mangostana. Bioorg Med Chem Lett20:6045-7 (2010) 
 
Fatty acid synthase
Name:Fatty acid synthase
Type:Enzyme
Mol. Mass.:273419.37
Organism:Homo sapiens (Human)
Description:P49327
Residue:2511
BDBM50241454
NameBDBM50241454
Synonyms:1,6-dihydroxy-3,7-dimethoxy-2,8-bis(3-methylbut-2-enyl)-9H-xanthen-9-one beta-mangostin
TypeSmall organic molecule
Emp. Form.C25H28O6
Mol. Mass.424.4862
SMILES[#6]-[#8]-c1cc2oc3cc(-[#8])c(-[#8]-[#6])c(-[#6]\[#6]=[#6](\[#6])-[#6])c3c(=O)c2c(-[#8])c1-[#6]\[#6]=[#6](\[#6])-[#6]