Reaction Details
TargetAcetylcholinesterase
LigandBDBM8961
Substrate/Competitorn/a
Meas. Tech.ChEMBL_665090 (CHEMBL1260200)
IC50 500±n/a nM
Citation Korabecny, JMusilek, KHolas, OBinder, JZemek, FMarek, JPohanka, MOpletalova, VDohnal, VKuca, K Synthesis and in vitro evaluation of N-alkyl-7-methoxytacrine hydrochlorides as potential cholinesterase inhibitors in Alzheimer disease. Bioorg Med Chem Lett20:6093-5 (2010) 
 
Acetylcholinesterase
Name:Acetylcholinesterase
Type:Enzyme
Mol. Mass.:67792.70
Organism:Homo sapiens (Human)
Description:P22303
Residue:614
BDBM8961
NameBDBM8961
Synonyms:1,2,3,4-tetrahydro-9-acridinamine 9-THA CHEMBL1337960 Cognex Tracine cid_1935 | tacrine.HCl
TypeSmall organic molecule
Emp. Form.C13H14N2
Mol. Mass.198.2637
SMILESNc1c2CCCCc2nc2ccccc12