Reaction Details
TargetInsulin-like growth factor 1 receptor
LigandBDBM50327950
Substrate/Competitorn/a
Meas. Tech.ChEMBL_665187 (CHEMBL1260606)
IC50 4.1±n/a nM
Citation Wang, GTMantei, RAHubbard, RDWilsbacher, JLZhang, QTucker, LHu, XKovar, PJohnson, EFOsterling, DJBouska, JWang, JDavidsen, SKBell, RLSheppard, GS Substituted 4-amino-1H-pyrazolo[3,4-d]pyrimidines as multi-targeted inhibitors of insulin-like growth factor-1 receptor (IGF1R) and members of ErbB-family receptor kinases. Bioorg Med Chem Lett20:6067-71 (2010) 
 
Insulin-like growth factor 1 receptor
Name:Insulin-like growth factor 1 receptor
Type:Protein
Mol. Mass.:154776.79
Organism:Homo sapiens (Human)
Description:P08069
Residue:1367
BDBM50327950
NameBDBM50327950
Synonyms:CHEMBL1256435 | trans-N-(4-(4-amino-1-(4-(4-methylpiperazin-1-yl)cyclohexyl)-1H-pyrazolo[3,4-d]pyrimidin-3-yl)-3-chlorophenyl)-7-chlorobenzo[d]oxazol-2-amine
TypeSmall organic molecule
Emp. Form.C29H31Cl2N9O
Mol. Mass.592.522
SMILESCN1CCN(CC1)[C@H]1CC[C@@H](CC1)n1nc(-c2ccc(Nc3nc4cccc(Cl)c4o3)cc2Cl)c2c(N)ncnc12