Reaction Details
TargetBeta-2 adrenergic receptor
LigandBDBM50328298
Substrate/Competitorn/a
Meas. Tech.ChEMBL_665492 (CHEMBL1261323)
Ki 11±n/a nM
Citation Tasler, SBaumgartner, RAmmendola, ASchachtner, JWieber, TBlisse, MRath, SZaja, MKlahn, PQuotschalla, UNey, P Thienopyrimidines asß3-adrenoceptor agonists: hit-to-lead optimization. Bioorg Med Chem Lett20:6108-15 (2010) 
 
Beta-2 adrenergic receptor
Name:Beta-2 adrenergic receptor
Type:n/a
Mol. Mass.:46461.69
Organism:Homo sapiens (Human)
Description:P07550
Residue:413
BDBM50328298
NameBDBM50328298
Synonyms:2-ethyl-4-(2-hydroxy-3-(1-(5-phenylthieno[2,3-d]pyrimidin-4-yl)piperidin-4-ylamino)propoxy)phenol | CHEMBL1257797
TypeSmall organic molecule
Emp. Form.C28H32N4O3S
Mol. Mass.504.644
SMILESCCc1cc(OCC(O)CNC2CCN(CC2)c2ncnc3scc(-c4ccccc4)c23)ccc1O