Reaction Details
TargetBeta-2 adrenergic receptor
LigandBDBM50328336
Substrate/Competitorn/a
Meas. Tech.ChEMBL_665484 (CHEMBL1261259)
IC50 100±n/a nM
Citation Tasler, SBaumgartner, RAmmendola, ASchachtner, JWieber, TBlisse, MRath, SZaja, MKlahn, PQuotschalla, UNey, P Thienopyrimidines asß3-adrenoceptor agonists: hit-to-lead optimization. Bioorg Med Chem Lett20:6108-15 (2010) 
 
Beta-2 adrenergic receptor
Name:Beta-2 adrenergic receptor
Type:n/a
Mol. Mass.:46461.69
Organism:Homo sapiens (Human)
Description:P07550
Residue:413
BDBM50328336
NameBDBM50328336
Synonyms:3-(2-hydroxy-3-(1-(5-phenylthieno[2,3-d]pyrimidin-4-yl)piperidin-4-ylamino)propoxy)phenol | CHEMBL1257913
TypeSmall organic molecule
Emp. Form.C26H28N4O3S
Mol. Mass.476.591
SMILESOC(CNC1CCN(CC1)c1ncnc2scc(-c3ccccc3)c12)COc1cccc(O)c1