Reaction Details
TargetBeta-3 adrenergic receptor
LigandBDBM50328294
Substrate/Competitorn/a
Meas. Tech.ChEMBL_665493 (CHEMBL1261324)
Ki 11±n/a nM
Citation Tasler, SBaumgartner, RAmmendola, ASchachtner, JWieber, TBlisse, MRath, SZaja, MKlahn, PQuotschalla, UNey, P Thienopyrimidines asß3-adrenoceptor agonists: hit-to-lead optimization. Bioorg Med Chem Lett20:6108-15 (2010) 
 
Beta-3 adrenergic receptor
Name:Beta-3 adrenergic receptor
Type:G Protein-Coupled Receptor (GPCR)
Mol. Mass.:43534.88
Organism:Homo sapiens (Human)
Description:n/a
Residue:408
BDBM50328294
NameBDBM50328294
Synonyms:1-phenoxy-3-(1-(5-(thiophen-2-yl)thieno[2,3-d]pyrimidin-4-yl)piperidin-4-ylamino)propan-2-ol | CHEMBL1258025
TypeSmall organic molecule
Emp. Form.C24H26N4O2S2
Mol. Mass.466.619
SMILESOC(CNC1CCN(CC1)c1ncnc2scc(-c3cccs3)c12)COc1ccccc1